BDBM517859 Preparation of N-(2-((2-(dimethylamino)ethyl)(methyl)amino)-5-((4-(4-fluoro-1-isopropyl-2-methyl-1H-benzo[d]imidazol-6-yl)pyrimidin-2-yl)amino)-4-methoxyphenyl)-N-methylacrylamide::US11111233, Example 68
SMILES COc1cc(N(C)CCN(C)C)c(cc1Nc1nccc(n1)-c1cc(F)c2nc(C)n(C(C)C)c2c1)N(C)C(=O)C=C
InChI Key InChIKey=PUHHTFPUTDJKIQ-UHFFFAOYSA-N
Data  2 IC50
  Tab Delimited (TSV)   2D SDfile   Computed 3D by Vconf -m prep SDfile
Find this compound or compounds like it in BindingDB:
Activity Spreadsheet -- Enzyme Inhibition Constant Data from BindingDB
Found 2 hits for monomerid = 517859
TargetEpidermal growth factor receptor [T790M,L858R](Homo sapiens (Human))
Shenzhen Targetrx
US Patent
LigandPNGBDBM517859(Preparation of N-(2-((2-(dimethylamino)ethyl)(meth...)
Affinity DataIC50: <1nM. Assay description: Reagents and Materials:WT EGFR (Carna, Cat. No. 08-115), EGFR [L858R] (Carna, Cat. No. 08-502), EGFR [L858R/T790M] (Carna, Cat. No. 08-510), ATP (Sig...
Ligand InfoPC cidPC sid
In DepthDetails US Patent
TargetEpidermal growth factor receptor(Homo sapiens (Human))
Shenzhen Targetrx
US Patent
LigandPNGBDBM517859(Preparation of N-(2-((2-(dimethylamino)ethyl)(meth...)
Affinity DataIC50:  25nM. Assay description: Reagents and Materials:WT EGFR (Carna, Cat. No. 08-115), EGFR [L858R] (Carna, Cat. No. 08-502), EGFR [L858R/T790M] (Carna, Cat. No. 08-510), ATP (Sig...
Ligand InfoPC cidPC sid
In DepthDetails US Patent