BDBM518173 US11111247, Example 9
SMILES C[C@@H]1CN(CCN1)c1ccc(cn1)-c1n[nH]c2cnc(nc12)N1[C@@H](C)CN(C[C@H]1C)C(=O)N1CCCC1
InChI Key
Data  12 IC50
  Tab Delimited (TSV)   2D SDfile   Computed 3D by Vconf -m prep SDfile
Find this compound or compounds like it in BindingDB:
Activity Spreadsheet -- Enzyme Inhibition Constant Data from BindingDB
Found 12 hits for monomerid = 518173
TargetActivin receptor type-1 [147-509](Homo sapiens (Human))
Incyte
US Patent
LigandPNGBDBM518173(US11111247, Example 9)
Affinity DataIC50: <100nM. Assay description: ALK2 (aa 147-end) was obtained from BPS biosciences. The enzymatic assays were conducted in white 384-well polystyrene plates in a final volume of 8 ...
Ligand InfoPC cidPC sid
In DepthDetails US Patent
TargetActivin receptor type-1 [147-509](Homo sapiens (Human))
Incyte
US Patent
LigandPNGBDBM518173(US11111247, Example 9)
Affinity DataIC50: <100nM. Assay description: ALK2 (aa 147-end) was obtained from BPS biosciences. The enzymatic assays were conducted in white 384-well polystyrene plates in a final volume of 8 ...
Ligand InfoPC cidPC sid
In DepthDetails US Patent
TargetActivin receptor type-1 [147-509](Homo sapiens (Human))
Incyte
US Patent
LigandPNGBDBM518173(US11111247, Example 9)
Affinity DataIC50: <100nM. Assay description: ALK2 (aa 147-end) was obtained from BPS biosciences. The enzymatic assays were conducted in white 384-well polystyrene plates in a final volume of 8 ...
Ligand InfoPC cidPC sid
In DepthDetails US Patent
TargetFibroblast growth factor receptor 3(Homo sapiens (Human))
Incyte
US Patent
LigandPNGBDBM518173(US11111247, Example 9)
Affinity DataIC50:  300nM. Assay description: un-Phosphorylated (UP): The inhibitor potency of the exemplified compounds was determined in an enzyme discontinuous assay that measures peptide phos...
Ligand InfoPC cidPC sid
In DepthDetails US Patent
TargetFibroblast growth factor receptor 1(Homo sapiens (Human))
Incyte
US Patent
LigandPNGBDBM518173(US11111247, Example 9)
Affinity DataIC50:  1.25E+3nM. Assay description: un-Phosphorylated (UP): The inhibitor potency of the exemplified compounds was determined in an enzyme discontinuous assay that measures peptide phos...
Ligand InfoPC cidPC sid
In DepthDetails US Patent
TargetHepcidin(Homo sapiens)
Incyte
Curated by ChEMBL
LigandPNGBDBM518173(US11111247, Example 9)
Affinity DataIC50:  28nM. Assay description: Inhibition of Hepcidin in human Huh-7 cells assessed as inhibition of BMP-7 induced hepcidin production incubated for 16 to 24 hrs by ELISA method
Ligand InfoPC cidPC sid
In DepthDetails PubMed
TargetActivin receptor type-1(Homo sapiens (Human))
Incyte
Curated by ChEMBL
LigandPNGBDBM518173(US11111247, Example 9)
Affinity DataIC50:  1.20nM. Assay description: Inhibition of human recombinant N-terminal GST tagged ALK2 (147 to end residues) expressed in baculovirus infected in Sf9 cells assessed as loss of p...
Ligand InfoPC cidPC sid
In DepthDetails PubMed
TargetActivin receptor type-1(Homo sapiens (Human))
Incyte
Curated by ChEMBL
LigandPNGBDBM518173(US11111247, Example 9)
Affinity DataIC50:  39nM. Assay description: Inhibition of ALK2 in human HeLa cells assessed as reduction in BMP-7 induced SMAD1 phosphorylation incubated for 1 hr followed BMP-7 stimulation for...
Ligand InfoPC cidPC sid
In DepthDetails PubMed
TargetSerine/threonine-protein kinase receptor R3(Homo sapiens (Human))
Incyte
Curated by ChEMBL
LigandPNGBDBM518173(US11111247, Example 9)
Affinity DataIC50:  10nM. Assay description: Inhibition of recombinant human C-terminal GST tagged ALK1 (144 to end residues) expressed in baculovirus assessed as loss of peptide phosphorylation...
Ligand InfoPC cidPC sid
In DepthDetails PubMed
TargetBone morphogenetic protein receptor type-1A(Homo sapiens (Human))
Incyte
Curated by ChEMBL
LigandPNGBDBM518173(US11111247, Example 9)
Affinity DataIC50:  538nM. Assay description: Inhibition of recombinant human N-terminal GST-tagged ALK3 (187 to 532 residues) expressed in baculovirus assessed as loss of peptide phosphorylation...
Ligand InfoPC cidPC sid
In DepthDetails PubMed
TargetTGF-beta receptor type-1(Homo sapiens (Human))
Incyte
Curated by ChEMBL
LigandPNGBDBM518173(US11111247, Example 9)
Affinity DataIC50:  52nM. Assay description: Inhibition of recombinant human GST-tagged full length ALK5 expressed in baculovirus assessed as loss of peptide phosphorylation activity using pepti...
Ligand InfoPC cidPC sid
In DepthDetails PubMed
TargetFibroblast growth factor receptor 2(Homo sapiens (Human))
Incyte
US Patent
LigandPNGBDBM518173(US11111247, Example 9)
Affinity DataIC50:  300nM. Assay description: un-Phosphorylated (UP): The inhibitor potency of the exemplified compounds was determined in an enzyme discontinuous assay that measures peptide phos...
Ligand InfoPC cidPC sid
In DepthDetails US Patent