BDBM522102 US11160797, Example 10
SMILES CN1C(=O)Cc2cc(ccc12)-c1cncc(c1)-c1ccc(=O)n(c1)C1CC1
InChI Key InChIKey=JNHOSPJQAAEXMO-UHFFFAOYSA-N
Data  7 IC50
  Tab Delimited (TSV)   2D SDfile   Computed 3D by Vconf -m prep SDfile
Find this compound or compounds like it in BindingDB:
Activity Spreadsheet -- Enzyme Inhibition Constant Data from BindingDB
Found 7 hits for monomerid = 522102
TargetActivin receptor type-1 [172-499](Homo sapiens (Human))
Novartis
US Patent
LigandPNGBDBM522102(US11160797, Example 10)
Affinity DataIC50:  710nM. Assay description: Example 53: The assays were performed in 384-well, low volume microtiter assay plates in a final reaction volume of 6 ul. Dose-response curves were g...
Ligand InfoPC cidPC sid
In DepthDetails US Patent
TargetBone morphogenetic protein receptor type-1A [198-525](Homo sapiens (Human))
Novartis
US Patent
LigandPNGBDBM522102(US11160797, Example 10)
Affinity DataIC50:  2.00E+3nM. Assay description: Example 53: The assays were performed in 384-well, low volume microtiter assay plates in a final reaction volume of 6 ul. Dose-response curves were g...
Ligand InfoPC cidPC sid
In DepthDetails US Patent
TargetActivin receptor type-1 [172-499](Homo sapiens (Human))
Novartis
US Patent
LigandPNGBDBM522102(US11160797, Example 10)
Affinity DataIC50:  410nM. Assay description: Example 54:The assays were performed in 384-well, low volume microtiter assay plates in a final reaction volume of 9 ul. Dose-response curves were ge...
Ligand InfoPC cidPC sid
In DepthDetails US Patent
TargetBone morphogenetic protein receptor type-1B [168-495](Homo sapiens (Human))
Novartis
US Patent
LigandPNGBDBM522102(US11160797, Example 10)
Affinity DataIC50:  6.40E+3nM. Assay description: Example 54:The assays were performed in 384-well, low volume microtiter assay plates in a final reaction volume of 9 ul. Dose-response curves were ge...
Ligand InfoPC cidPC sid
In DepthDetails US Patent
TargetSerine/threonine-protein kinase receptor R3 [166-493](Homo sapiens (Human))
Novartis
US Patent
LigandPNGBDBM522102(US11160797, Example 10)
Affinity DataIC50:  2.90E+3nM. Assay description: Example 54:The assays were performed in 384-well, low volume microtiter assay plates in a final reaction volume of 9 ul. Dose-response curves were ge...
Ligand InfoPC cidPC sid
In DepthDetails US Patent
TargetTGF-beta receptor type-1 [162-503](Homo sapiens (Human))
Novartis
US Patent
LigandPNGBDBM522102(US11160797, Example 10)
Affinity DataIC50: >1.00E+4nM. Assay description: Example 54:The assays were performed in 384-well, low volume microtiter assay plates in a final reaction volume of 9 ul. Dose-response curves were ge...
Ligand InfoPC cidPC sid
In DepthDetails US Patent
TargetActivin receptor type-1 [172-499,R206H](Homo sapiens (Human))
Novartis
US Patent
LigandPNGBDBM522102(US11160797, Example 10)
Affinity DataIC50:  390nM. Assay description: Example 54:The assays were performed in 384-well, low volume microtiter assay plates in a final reaction volume of 9 ul. Dose-response curves were ge...
Ligand InfoPC cidPC sid
In DepthDetails US Patent