BDBM522112 US11160797, Example 20
SMILES CCN1C(=O)Cc2cc(ccc12)-c1cncc(c1)-c1ccc(=O)n(c1)C(C)C
InChI Key InChIKey=GGDVEPRDLUWBFD-UHFFFAOYSA-N
Data  7 IC50
  Tab Delimited (TSV)   2D SDfile   Computed 3D by Vconf -m prep SDfile
Find this compound or compounds like it in BindingDB:
Activity Spreadsheet -- Enzyme Inhibition Constant Data from BindingDB
Found 7 hits for monomerid = 522112
TargetActivin receptor type-1 [172-499](Homo sapiens (Human))
Novartis
US Patent
LigandPNGBDBM522112(US11160797, Example 20)
Affinity DataIC50:  110nM. Assay description: Example 53: The assays were performed in 384-well, low volume microtiter assay plates in a final reaction volume of 6 ul. Dose-response curves were g...
Ligand InfoPC cidPC sid
In DepthDetails US Patent
TargetBone morphogenetic protein receptor type-1A [198-525](Homo sapiens (Human))
Novartis
US Patent
LigandPNGBDBM522112(US11160797, Example 20)
Affinity DataIC50:  620nM. Assay description: Example 53: The assays were performed in 384-well, low volume microtiter assay plates in a final reaction volume of 6 ul. Dose-response curves were g...
Ligand InfoPC cidPC sid
In DepthDetails US Patent
TargetActivin receptor type-1 [172-499](Homo sapiens (Human))
Novartis
US Patent
LigandPNGBDBM522112(US11160797, Example 20)
Affinity DataIC50:  90nM. Assay description: Example 54:The assays were performed in 384-well, low volume microtiter assay plates in a final reaction volume of 9 ul. Dose-response curves were ge...
Ligand InfoPC cidPC sid
In DepthDetails US Patent
TargetBone morphogenetic protein receptor type-1B [168-495](Homo sapiens (Human))
Novartis
US Patent
LigandPNGBDBM522112(US11160797, Example 20)
Affinity DataIC50:  490nM. Assay description: Example 54:The assays were performed in 384-well, low volume microtiter assay plates in a final reaction volume of 9 ul. Dose-response curves were ge...
Ligand InfoPC cidPC sid
In DepthDetails US Patent
TargetSerine/threonine-protein kinase receptor R3 [166-493](Homo sapiens (Human))
Novartis
US Patent
LigandPNGBDBM522112(US11160797, Example 20)
Affinity DataIC50:  610nM. Assay description: Example 54:The assays were performed in 384-well, low volume microtiter assay plates in a final reaction volume of 9 ul. Dose-response curves were ge...
Ligand InfoPC cidPC sid
In DepthDetails US Patent
TargetTGF-beta receptor type-1 [162-503](Homo sapiens (Human))
Novartis
US Patent
LigandPNGBDBM522112(US11160797, Example 20)
Affinity DataIC50:  2.50E+3nM. Assay description: Example 54:The assays were performed in 384-well, low volume microtiter assay plates in a final reaction volume of 9 ul. Dose-response curves were ge...
Ligand InfoPC cidPC sid
In DepthDetails US Patent
TargetActivin receptor type-1 [172-499,R206H](Homo sapiens (Human))
Novartis
US Patent
LigandPNGBDBM522112(US11160797, Example 20)
Affinity DataIC50:  90nM. Assay description: Example 54:The assays were performed in 384-well, low volume microtiter assay plates in a final reaction volume of 9 ul. Dose-response curves were ge...
Ligand InfoPC cidPC sid
In DepthDetails US Patent