BDBM523140 US11161864, Example 1C
SMILES Nc1cc2n(cnc2c(=O)[nH]1)[C@H]1O[C@@H]2COP(S)(=O)OCCn3c(COP(S)(=O)O[C@@H]1[C@H]2F)nc1cncnc31
InChI Key
Data  3 IC50
  Tab Delimited (TSV)   2D SDfile   Computed 3D by Vconf -m prep SDfile
Find this compound or compounds like it in BindingDB:
Activity Spreadsheet -- Enzyme Inhibition Constant Data from BindingDB
Found 3 hits for monomerid = 523140
TargetStimulator of interferon genes protein(Human)
Venenum Biodesign
US Patent
LigandPNGBDBM523140(US11161864, Example 1C)
Affinity DataIC50: <1.00E+3nM. Assay description: A human STING [3H] 2′,3′-cGAMP scintillation proximity competition binding assay was utilized to detect binding of compounds to STING pro...
Ligand InfoPC cidPC sid
In DepthDetails US Patent
TargetStimulator of interferon genes protein [154-378](Mus musculus (Mouse))
Venenum Biodesign
US Patent
LigandPNGBDBM523140(US11161864, Example 1C)
Affinity DataIC50: <1.00E+3nM. Assay description: The murine STING [3H] 2′,3′-cGAMP scintillation proximity competition binding assay was performed in the same manner as the human STING c...
Ligand InfoPC cidPC sid
In DepthDetails US Patent
TargetStimulator of interferon genes protein [155-379](Homo sapiens (Human))
Venenum Biodesign
US Patent
LigandPNGBDBM523140(US11161864, Example 1C)
Affinity DataIC50: <1.00E+3nM. Assay description: A human STING [3H] 2′,3′-cGAMP scintillation proximity competition binding assay was utilized to detect binding of compounds to STING pro...
Ligand InfoPC cidPC sid
In DepthDetails US Patent