BDBM528115 N-[(6-cyano-2-fluoro-3-methoxyphenyl)methyl]-3-(methoxymethyl)-1-({6-[(2- oxopyridin-1-yl)methyl]pyridin-3-yl}methyl)pyrazole-4-carboxamide::US11180484, Example 52
SMILES COCc1nn(Cc2ccc(Cn3ccccc3=O)nc2)cc1C(=O)NCc1c(F)c(OC)ccc1C#N
InChI Key InChIKey=YPPJNDBRBJRPMM-UHFFFAOYSA-N
Data  4 IC50
  Tab Delimited (TSV)   2D SDfile   Computed 3D by Vconf -m prep SDfile
Find this compound or compounds like it in BindingDB:
Activity Spreadsheet -- Enzyme Inhibition Constant Data from BindingDB
Found 4 hits for monomerid = 528115
TargetPlasma kallikrein(Homo sapiens (Human))
Kalvista Pharmaceuticals
US Patent
LigandPNGBDBM528115(N-[(6-cyano-2-fluoro-3-methoxyphenyl)methyl]-3-(me...)
Affinity DataIC50:  6.40nM. Assay description: Plasma kallikrein inhibitory activity in vitro was determined using standard published methods (see e.g. Johansen et al., Int. J. Tiss. Reac. 1986, 8...
Ligand InfoPC cidPC sid
In DepthDetails US Patent
TargetCoagulation factor XII(Homo sapiens (Human))
Kalvista Pharmaceuticals
US Patent
LigandPNGBDBM528115(N-[(6-cyano-2-fluoro-3-methoxyphenyl)methyl]-3-(me...)
Affinity DataIC50: >4.00E+3nM. Assay description: Factor XIIa inhibitory activity in vitro was determined using standard published methods (see e.g. Shori et al., Biochem. Pharmacol., 1992, 43, 1209;...
Ligand InfoPC cidPC sid
In DepthDetails US Patent
TargetCoagulation factor XI(Homo sapiens (Human))
Kalvista Pharmaceuticals
US Patent
LigandPNGBDBM528115(N-[(6-cyano-2-fluoro-3-methoxyphenyl)methyl]-3-(me...)
Affinity DataIC50: >4.00E+4nM. Assay description: FXIa inhibitory activity in vitro was determined using standard published methods (see e.g. Johansen et al., Int. J. Tiss. Reac. 1986, 8, 185; Shori ...
Ligand InfoPC cidPC sid
In DepthDetails US Patent
TargetKallikrein-1(Homo sapiens (Human))
Kalvista Pharmaceuticals
US Patent
LigandPNGBDBM528115(N-[(6-cyano-2-fluoro-3-methoxyphenyl)methyl]-3-(me...)
Affinity DataIC50: >4.00E+3nM. Assay description: KLK1 inhibitory activity in vitro was determined using standard published methods (see e.g. Johansen et al., Int. J. Tiss. Reac. 1986, 8, 185; Shori ...
Ligand InfoPC cidPC sid
In DepthDetails US Patent