BDBM529912 US11203594, Example 22
SMILES Cc1cc(=O)[nH]c2nc(N[C@@H]3CCOC[C@H]3O)nc([C@@H]3CCC[C@]3(C)F)c12
InChI Key InChIKey=RKUPKTQQPJAABW-HAKKBZAZSA-N
Data  1 KI
  Tab Delimited (TSV)   2D SDfile   Computed 3D by Vconf -m prep SDfile
Find this compound or compounds like it in BindingDB:
Activity Spreadsheet -- Enzyme Inhibition Constant Data from BindingDB
Found 1 hit for monomerid = 529912
TargetCyclin-dependent kinase 6/G1/S-specific cyclin-D3(Homo sapiens (Human))
Pfizer
US Patent
LigandPNGBDBM529912(US11203594, Example 22)
Affinity DataKi:  2.80nM. Assay description: The purpose of the CDK6/Cyclin D3 assay is to evaluate the inhibition (% inhibition, Kiapp and Ki values) in the presence of small molecule inhibitor...
Ligand InfoPC cidPC sid
In DepthDetails US Patent