BDBM531289 US11208399, Example 48
SMILES CN1CCC[C@H](C1)Nc1nnc(c(C)c1C)-c1ccc(cc1O)C(F)(F)F
InChI Key InChIKey=MUNKPAUFEPNDGH-CQSZACIVSA-N
Data  2 IC50
  Tab Delimited (TSV)   2D SDfile   Computed 3D by Vconf -m prep SDfile
Find this compound or compounds like it in BindingDB:
Activity Spreadsheet -- Enzyme Inhibition Constant Data from BindingDB
Found 2 hits for monomerid = 531289
TargetTumor necrosis factor(Homo sapiens (Human))
Novartis
US Patent
LigandPNGBDBM531289(US11208399, Example 48)
Affinity DataIC50: >1.00E+5nM. Assay description: Monocytic THP-1 cells were maintained according to providers' instructions in RPMI media as described above. Undifferentiated cells were plated a...
Ligand InfoPC cidPC sid
In DepthDetails US Patent
TargetInterleukin-1 beta(Homo sapiens (Human))
Novartis
US Patent
LigandPNGBDBM531289(US11208399, Example 48)
Affinity DataIC50:  0.800nM. Assay description: Monocytic THP-1 cells (ATCC: TIB-202) were maintained according to providers' instructions in RPMI media (RPMI/Hepes+10% fetal bovine serum+Sodiu...
Ligand InfoPC cidPC sid
In DepthDetails US Patent