BDBM532285 N-(2,6-diethylphenyl)-8-(2-methoxy-4-piperazin-1-yl-anilino)-1-methyl-4,5-dihydropyrazolo[4,3-h]quinazoline-3-carboxamide::US11208696, Example 4::WITJ113B
SMILES CCc1cccc(CC)c1NC(=O)c1nn(C)c-2c1CCc1cnc(Nc3ccc(cc3OC)N3CCNCC3)nc-21
InChI Key InChIKey=FURDSRVNHPECLK-UHFFFAOYSA-N
Data  1 IC50
  Tab Delimited (TSV)   2D SDfile   Computed 3D by Vconf -m prep SDfile
Find this compound or compounds like it in BindingDB:
Activity Spreadsheet -- Enzyme Inhibition Constant Data from BindingDB
Found 1 hit for monomerid = 532285
TargetDual specificity protein kinase TTK(Homo sapiens (Human))
Netherlands Translational Research Center
US Patent
LigandPNGBDBM532285(N-(2,6-diethylphenyl)-8-(2-methoxy-4-piperazin-1-y...)
Affinity DataIC50:  0.490nM. Assay description: The inhibitory activity of compounds on biochemically purified full-length TTK (Life Technologies, Madison, Wis., U.S.A.) was determined in the IMAP®...
Ligand InfoPC cidPC sid
In DepthDetails US Patent