BDBM532300 JDM640A::N-[1-[2-(2-ethoxyethoxy)ethyl]-3,5-dimethyl-pyrazol-4-yl]-2-[2-methoxy-4-(4-methylpiperazin-1-yl)anilino]-5,6-dihydropyrimido[4,5-e]indolizine-7-carboxamide::US11208696, Example 19
SMILES CCOCCOCCn1nc(C)c(NC(=O)c2ccn-3c2CCc2cnc(Nc4ccc(cc4OC)N4CCN(C)CC4)nc-32)c1C
InChI Key InChIKey=QVPQDJAVWIJHRM-UHFFFAOYSA-N
Data  1 IC50
  Tab Delimited (TSV)   2D SDfile   Computed 3D by Vconf -m prep SDfile
Find this compound or compounds like it in BindingDB:
Activity Spreadsheet -- Enzyme Inhibition Constant Data from BindingDB
Found 1 hit for monomerid = 532300
TargetDual specificity protein kinase TTK(Homo sapiens (Human))
Netherlands Translational Research Center
US Patent
LigandPNGBDBM532300(JDM640A | N-[1-[2-(2-ethoxyethoxy)ethyl]-3,5-dimet...)
Affinity DataIC50:  1.14nM. Assay description: The inhibitory activity of compounds on biochemically purified full-length TTK (Life Technologies, Madison, Wis., U.S.A.) was determined in the IMAP®...
Ligand InfoPC cidPC sid
In DepthDetails US Patent