BDBM532306 JDM703A::N-[3,5-diethyl-1-[2-[2-(2-methoxyethoxy)ethoxy]ethyl]pyrazol-4-yl]-2-[4-[4-[2-(ethylamino)acetyl]piperazin-1-yl]-2-methoxy-anilino]-5,6-dihydropyrimido[4,5-e]indolizine-7-carboxamide::US11208696, Example 25
SMILES CCNCC(=O)N1CCN(CC1)c1ccc(Nc2ncc3CCc4c(ccn4-c3n2)C(=O)Nc2c(CC)nn(CCOCCOCCOC)c2CC)c(OC)c1
InChI Key InChIKey=WBORTVDYHYVISM-UHFFFAOYSA-N
Data  1 IC50
  Tab Delimited (TSV)   2D SDfile   Computed 3D by Vconf -m prep SDfile
Find this compound or compounds like it in BindingDB:
Activity Spreadsheet -- Enzyme Inhibition Constant Data from BindingDB
Found 1 hit for monomerid = 532306
TargetDual specificity protein kinase TTK(Homo sapiens (Human))
Netherlands Translational Research Center
US Patent
LigandPNGBDBM532306(JDM703A | N-[3,5-diethyl-1-[2-[2-(2-methoxyethoxy)...)
Affinity DataIC50:  0.430nM. Assay description: The inhibitory activity of compounds on biochemically purified full-length TTK (Life Technologies, Madison, Wis., U.S.A.) was determined in the IMAP®...
Ligand InfoPC cidPC sid
In DepthDetails US Patent