BDBM532309 JGS0715B::N-cyclopropyl-4-[6-(2,3-difluoro-4-methoxy-phenoxy)-8-(3,3,3-trifluoropropylamino)imidazo[1,2-b]pyridazin-3-yl]-2-methyl-benzamide::US11208696, Example 28
SMILES COc1ccc(Oc2nc(NCCC(F)(F)F)c3ncc(-c4ccc(C(=O)NC5CC5)c(C)c4)n3n2)c(F)c1F
InChI Key InChIKey=JMZXUKRNNCWQNP-UHFFFAOYSA-N
Data  1 IC50
  Tab Delimited (TSV)   2D SDfile   Computed 3D by Vconf -m prep SDfile
Find this compound or compounds like it in BindingDB:
Activity Spreadsheet -- Enzyme Inhibition Constant Data from BindingDB
Found 1 hit for monomerid = 532309
TargetDual specificity protein kinase TTK(Homo sapiens (Human))
Netherlands Translational Research Center
US Patent
LigandPNGBDBM532309(JGS0715B | N-cyclopropyl-4-[6-(2,3-difluoro-4-meth...)
Affinity DataIC50:  0.790nM. Assay description: The inhibitory activity of compounds on biochemically purified full-length TTK (Life Technologies, Madison, Wis., U.S.A.) was determined in the IMAP®...
Ligand InfoPC cidPC sid
In DepthDetails US Patent