BDBM54126 (4E)-2-(6-methyl-2-pyridinyl)-4-[[2-(5-oxo-3-sulfanylidene-2H-1,2,4-triazin-6-yl)anilino]methylidene]isoquinoline-1,3-dione::(4E)-2-(6-methylpyridin-2-yl)-4-[[2-(5-oxo-3-sulfanylidene-2H-1,2,4-triazin-6-yl)anilino]methylidene]isoquinoline-1,3-dione::(4E)-2-(6-methylpyridin-2-yl)-4-[[[2-(5-oxidanylidene-3-sulfanylidene-2H-1,2,4-triazin-6-yl)phenyl]amino]methylidene]isoquinoline-1,3-dione::(4E)-4-[[2-(5-keto-3-thioxo-2H-1,2,4-triazin-6-yl)anilino]methylene]-2-(6-methyl-2-pyridyl)isoquinoline-1,3-quinone::4-[1-[2-(5-Hydroxy-3-mercapto-[1,2,4]triazin-6-yl)-phenylamino]-meth-(E)-ylidene]-2-(6-methyl-pyridin-2- yl)-4H-isoquinoline-1,3-dione::MLS000779047::SMR000415724::cid_6357078
SMILES Cc1cccc(n1)-n1c(O)c(C=Nc2ccccc2-c2n[nH]c(=S)[nH]c2=O)c2ccccc2c1=O
InChI Key InChIKey=PWPBONHHHMBGOK-UHFFFAOYSA-N
Data  2 IC50
  Tab Delimited (TSV)   2D SDfile   Computed 3D by Vconf -m prep SDfile
Find this compound or compounds like it in BindingDB:
Activity Spreadsheet -- Enzyme Inhibition Constant Data from BindingDB
Found 2 hits for monomerid = 54126
TargetInsulin-degrading enzyme(Homo sapiens (Human))
The Scripps Research Institute Molecular Screening Center
Curated by PubChem BioAssay
LigandPNGBDBM54126((4E)-2-(6-methyl-2-pyridinyl)-4-[[2-(5-oxo-3-sulfa...)
Affinity DataIC50:  1.22E+4nM. Assay description: Source (MLPCN Center Name): The Scripps Research Institute Molecular Screening Center (SRIMSC) Center Affiliation: The Scripps Research Institute (TS...
In DepthDetails PCBioAssay
TargetM1 family aminopeptidase(Plasmodium falciparum (isolate FcB1 / Columbia))
Srmlsc
Curated by PubChem BioAssay
LigandPNGBDBM54126((4E)-2-(6-methyl-2-pyridinyl)-4-[[2-(5-oxo-3-sulfa...)
Affinity DataIC50:  6.04E+4nM. Assay description: Southern Research Molecular Libraries Screening Center (SRMLSC) Southern Research Institute (Birmingham, Alabama) NIH Molecular Libraries Screening...
In DepthDetails PCBioAssay