BDBM54748 3-hydroxy-6-(hydroxymethyl)-2-(pyridin-2-yl{[3-(trifluoromethyl)phenyl]amino}methyl)-4H-pyran-4-one::3-hydroxy-6-(hydroxymethyl)-2-[2-pyridinyl-[3-(trifluoromethyl)anilino]methyl]-4-pyranone::3-hydroxy-6-(hydroxymethyl)-2-[pyridin-2-yl-[3-(trifluoromethyl)anilino]methyl]pyran-4-one::3-hydroxy-6-methylol-2-[2-pyridyl-[3-(trifluoromethyl)anilino]methyl]pyran-4-one::6-(hydroxymethyl)-3-oxidanyl-2-[pyridin-2-yl-[[3-(trifluoromethyl)phenyl]amino]methyl]pyran-4-one::MLS000766783::SMR000339679::cid_4172393
SMILES OCc1cc(=O)c(O)c(o1)C(Nc1cccc(c1)C(F)(F)F)c1ccccn1
InChI Key InChIKey=QXXFYAVFYIHEBC-UHFFFAOYSA-N
Data  3 IC50
  Tab Delimited (TSV)   2D SDfile   Computed 3D by Vconf -m prep SDfile
Find this compound or compounds like it in BindingDB:
Activity Spreadsheet -- Enzyme Inhibition Constant Data from BindingDB
Found 1 hit for monomerid = 54748
TargetVoltage-dependent N-type calcium channel subunit alpha-1B(Homo sapiens (Human))
Burnham Center For Chemical Genomics
Curated by PubChem BioAssay
LigandPNGBDBM54748(3-hydroxy-6-(hydroxymethyl)-2-(pyridin-2-yl{[3-(tr...)
Affinity DataIC50:  8.71E+3nM. Assay description: Data Source: Data Source: Sanford-Burnham Center for Chemical Genomics (SBCCG) Source Affiliation: Sanford-Burnham Medical Research Institute Network...
In DepthDetails PCBioAssay