BDBM56285 2-(4-chlorophenyl)-N-(5-keto-7,7-dimethyl-6,8-dihydroquinazolin-2-yl)acetamide::2-(4-chlorophenyl)-N-(7,7-dimethyl-5-oxidanylidene-6,8-dihydroquinazolin-2-yl)ethanamide::2-(4-chlorophenyl)-N-(7,7-dimethyl-5-oxo-6,8-dihydroquinazolin-2-yl)acetamide::MLS000109679::SMR000105619::cid_878804
SMILES CC1(C)CC(=O)c2cnc(NC(=O)Cc3ccc(Cl)cc3)nc2C1
InChI Key InChIKey=JASLCYRXBGMOOT-UHFFFAOYSA-N
Data  1 IC50
  Tab Delimited (TSV)   2D SDfile   Computed 3D by Vconf -m prep SDfile
Find this compound or compounds like it in BindingDB:
Activity Spreadsheet -- Enzyme Inhibition Constant Data from BindingDB
Found 1 hit for monomerid = 56285
TargetKallikrein-5(Homo sapiens (Human))
Pcmd
Curated by PubChem BioAssay
LigandPNGBDBM56285(2-(4-chlorophenyl)-N-(5-keto-7,7-dimethyl-6,8-dihy...)
Affinity DataIC50:  5.00E+4nM. Assay description: Molecular Library Screening Center Network (MLSCN) Penn Center for Molecular Discovery (PCMD) Assay Provider: Scott L. Diamond, University of Pennsy...
In DepthDetails PCBioAssay