BDBM563544 US11407768, Compound 1
SMILES OC[C@@H](O)[C@@H](O)[C@H](O)[C@@H](O)CNC(=O)c1ccc(cc1)-c1ccc(cc1)-c1nc2nc(O[C@@H]3CO[C@@H]4[C@H](O)CO[C@H]34)[nH]c2cc1Cl
InChI Key
Data  1 EC50
  Tab Delimited (TSV)   2D SDfile   Computed 3D by Vconf -m prep SDfile
Find this compound or compounds like it in BindingDB:
Activity Spreadsheet -- Enzyme Inhibition Constant Data from BindingDB
Found 1 hit for monomerid = 563544
LigandPNGBDBM563544(US11407768, Compound 1)
Affinity DataEC50:  0.0500nM. Assay description: Compound effect on AMPK enzyme activation was determined in a cell-free format with a 12-point concentration curve. The ADP-Glo detection system was ...
Ligand InfoPC cidPC sid
In DepthDetails US Patent