BDBM58961 (3-chloro-4-morpholino-phenyl)-(2-thenyl)amine::3-chloranyl-4-morpholin-4-yl-N-(thiophen-2-ylmethyl)aniline::3-chloro-4-(4-morpholinyl)-N-(thiophen-2-ylmethyl)aniline::3-chloro-4-morpholin-4-yl-N-(thiophen-2-ylmethyl)aniline::MLS000110371::SMR000106301::cid_755952
SMILES Clc1cc(NCc2cccs2)ccc1N1CCOCC1
InChI Key InChIKey=DKACBZOTLOOORO-UHFFFAOYSA-N
Data  1 IC50  1 EC50
  Tab Delimited (TSV)   2D SDfile   Computed 3D by Vconf -m prep SDfile
Find this compound or compounds like it in BindingDB:
Activity Spreadsheet -- Enzyme Inhibition Constant Data from BindingDB
Found 1 hit for monomerid = 58961
TargetLarge T antigen(Simian virus 40)
Southern Research Specialized Biocontainment Screening Center
Curated by PubChem BioAssay
LigandPNGBDBM58961((3-chloro-4-morpholino-phenyl)-(2-thenyl)amine | 3...)
Affinity DataIC50:  6.52E+4nM. Assay description: A biochemical assay using the ADP-Hunter methodology, purified TAg, and ATP to identify compounds that inhibit the ATPase activity of Tag Southern Re...
In DepthDetails PCBioAssay