BDBM59287 1-[(5-methylthiophen-2-yl)carbonylamino]-3-naphthalen-1-yl-thiourea::1-[(5-methylthiophene-2-carbonyl)amino]-3-(1-naphthyl)thiourea::1-[(5-methylthiophene-2-carbonyl)amino]-3-naphthalen-1-ylthiourea::1-[[(5-methyl-2-thiophenyl)-oxomethyl]amino]-3-(1-naphthalenyl)thiourea::2-[(5-methyl-2-thienyl)carbonyl]-N-1-naphthylhydrazinecarbothioamide::MLS000581198::SMR000199812::cid_970006
SMILES Cc1ccc(s1)C(=O)NNC(=S)Nc1cccc2ccccc12
InChI Key InChIKey=OEJQJXIMFOMOAD-UHFFFAOYSA-N
Data  1 EC50
  Tab Delimited (TSV)   2D SDfile   Computed 3D by Vconf -m prep SDfile
Find this compound or compounds like it in BindingDB:
Activity Spreadsheet -- Enzyme Inhibition Constant Data from BindingDB
Found 1 hit for monomerid = 59287
TargetAlkaline phosphatase, tissue-nonspecific isozyme(Homo sapiens (Human))
Sanford-Burnham Center For Chemical Genomics
Curated by PubChem BioAssay
LigandPNGBDBM59287(1-[(5-methylthiophen-2-yl)carbonylamino]-3-naphtha...)
Affinity DataEC50:  6.26E+4nM. Assay description: Data Source: Sanford-Burnham Center for Chemical Genomics (SBCCG) Source Affiliation: Sanford-Burnham Medical Research Institute (SBMRI, San Diego, C...
In DepthDetails PCBioAssay