BDBM602044 US11643417, Ex. No. 61
SMILES FC(F)(CN1CCNC(=O)c2oc3ccc(cc3c12)C(F)(F)F)C1CC(=O)CCC1(F)F
InChI Key InChIKey=ZHLDETDDKZZVJZ-UHFFFAOYSA-N
Data  1 KI
  Tab Delimited (TSV)   2D SDfile   Computed 3D by Vconf -m prep SDfile
Find this compound or compounds like it in BindingDB:
Activity Spreadsheet -- Enzyme Inhibition Constant Data from BindingDB
Found 1 hit for monomerid = 602044
TargetSerine/threonine-protein kinase pim-1(Homo sapiens (Human))
Japan Tobacco
US Patent
LigandPNGBDBM602044(US11643417, Ex. No. 61)
Affinity DataKi:  0.0390nM. Assay description: The calculation of the Pim-1 inhibitory activity of the compound was performed using the following solution according to the protocol attached to ADP...
Ligand InfoPC cidPC sid
In DepthDetails US Patent