BDBM60208 2-[2-(1-Allyl-1H-pyridin-4-ylidene)-ethylidene]-malononitrile::2-[2-(1-allyl-4-pyridylidene)ethylidene]malononitrile::2-[2-(1-prop-2-enyl-4-pyridinylidene)ethylidene]propanedinitrile::2-[2-(1-prop-2-enylpyridin-4-ylidene)ethylidene]propanedinitrile::MLS001029989::SMR000427183::cid_4343310
SMILES [#6]=[#6]-[#6]-[#7]-1-[#6]=[#6]\[#6](=[#6]\[#6]=[#6](\C#N)C#N)-[#6]=[#6]-1
InChI Key InChIKey=CJMFUFWDOCCMHN-UHFFFAOYSA-N
Data  2 IC50  1 EC50
  Tab Delimited (TSV)   2D SDfile   Computed 3D by Vconf -m prep SDfile
Find this compound or compounds like it in BindingDB:
Activity Spreadsheet -- Enzyme Inhibition Constant Data from BindingDB
Found 3 hits for monomerid = 60208
TargetM17 leucyl aminopeptidase(Plasmodium falciparum 3D7)
Srmlsc
Curated by PubChem BioAssay
LigandPNGBDBM60208(2-[2-(1-Allyl-1H-pyridin-4-ylidene)-ethylidene]-ma...)
Affinity DataIC50:  7.22E+4nM. Assay description: Southern Research Molecular Libraries Screening Center (SRMLSC) Southern Research Institute (Birmingham, Alabama) NIH Molecular Libraries Screening...
In DepthDetails PCBioAssay
TargetInsulin-degrading enzyme(Homo sapiens (Human))
The Scripps Research Institute Molecular Screening Center
Curated by PubChem BioAssay
LigandPNGBDBM60208(2-[2-(1-Allyl-1H-pyridin-4-ylidene)-ethylidene]-ma...)
Affinity DataIC50:  1.04E+4nM. Assay description: Source (MLPCN Center Name): The Scripps Research Institute Molecular Screening Center (SRIMSC) Center Affiliation: The Scripps Research Institute (TS...
In DepthDetails PCBioAssay
TargetImportin subunit alpha-1(Homo sapiens (Human))
Broad Institute
Curated by PubChem BioAssay
LigandPNGBDBM60208(2-[2-(1-Allyl-1H-pyridin-4-ylidene)-ethylidene]-ma...)
Affinity DataEC50:  1.67E+4nM. Assay description: Keywords: Counterscreen, FRET assay, HTS, YIC probe, Dose response, Assay Overview: This is a fluorescence resonance energy transfer (FRET)-based b...
In DepthDetails PCBioAssay