BDBM602126 US11643417, Ex. No. 138
SMILES OCC1CCC(CC1)C(F)(F)CN1CCNC(=O)c2oc3ccc(cc3c12)C(F)(F)F
InChI Key InChIKey=AVJWPHSCXJFPRY-UHFFFAOYSA-N
Data  1 KI
  Tab Delimited (TSV)   2D SDfile   Computed 3D by Vconf -m prep SDfile
Find this compound or compounds like it in BindingDB:
Activity Spreadsheet -- Enzyme Inhibition Constant Data from BindingDB
Found 1 hit for monomerid = 602126
TargetSerine/threonine-protein kinase pim-1(Homo sapiens (Human))
Japan Tobacco
US Patent
LigandPNGBDBM602126(US11643417, Ex. No. 138)
Affinity DataKi:  0.0150nM. Assay description: The calculation of the Pim-1 inhibitory activity of the compound was performed using the following solution according to the protocol attached to ADP...
Ligand InfoPC cidPC sid
In DepthDetails US Patent