BDBM602134 US11643417, Ex. No. 146
SMILES OCC1(CO)CCC(CCN2CCNC(=O)c3oc4ccc(cc4c23)C(F)(F)F)CC1
InChI Key InChIKey=MEBLCUXRHLPTKP-UHFFFAOYSA-N
Data  1 KI
  Tab Delimited (TSV)   2D SDfile   Computed 3D by Vconf -m prep SDfile
Find this compound or compounds like it in BindingDB:
Activity Spreadsheet -- Enzyme Inhibition Constant Data from BindingDB
Found 1 hit for monomerid = 602134
TargetSerine/threonine-protein kinase pim-1(Homo sapiens (Human))
Japan Tobacco
US Patent
LigandPNGBDBM602134(US11643417, Ex. No. 146)
Affinity DataKi:  0.0230nM. Assay description: The calculation of the Pim-1 inhibitory activity of the compound was performed using the following solution according to the protocol attached to ADP...
Ligand InfoPC cidPC sid
In DepthDetails US Patent