BDBM603886 US11655239, Compound S2
SMILES Cc1ccc(NC(=O)Nc2cc(nn2-c2ccccc2)C(C)(C)C)cc1-c1ccc2nc(Nc3cnn(C)c3)ncc2c1
InChI Key InChIKey=NXKOUQAVNYMLFS-UHFFFAOYSA-N
Data  1 IC50
  Tab Delimited (TSV)   2D SDfile   Computed 3D by Vconf -m prep SDfile
Find this compound or compounds like it in BindingDB:
Activity Spreadsheet -- Enzyme Inhibition Constant Data from BindingDB
Found 1 hit for monomerid = 603886
TargetDiscoidin domain-containing receptor 2(Homo sapiens (Human))
Shanghai Institute of Material Medica, Chinese Academy of Sciences
US Patent
LigandPNGBDBM603886(US11655239, Compound S2)
Affinity DataIC50:  0.600nM. Assay description: Enzyme reaction substrate Poly(Glu, Tyr) 4:1 was diluted to 20 μg/mL with potassium-free PBS (10 mM sodium phosphate buffer, 150 mM NaCl, pH 7.2...
Ligand InfoPC cidPC sid
In DepthDetails US Patent