BDBM603913 US11655239, Compound S42
SMILES C[C@H](NC(=O)c1cccc(c1)C(F)(F)F)c1ccc(C2CC2)c(c1)-c1ccc2cnc(NC3CCN(C)CC3)nc2c1
InChI Key InChIKey=HHXYTADGXSZART-FQEVSTJZSA-N
Data  1 IC50
  Tab Delimited (TSV)   2D SDfile   Computed 3D by Vconf -m prep SDfile
Find this compound or compounds like it in BindingDB:
Activity Spreadsheet -- Enzyme Inhibition Constant Data from BindingDB
Found 1 hit for monomerid = 603913
TargetDiscoidin domain-containing receptor 2(Homo sapiens (Human))
Shanghai Institute of Material Medica, Chinese Academy of Sciences
US Patent
LigandPNGBDBM603913(US11655239, Compound S42)
Affinity DataIC50:  2.30nM. Assay description: Enzyme reaction substrate Poly(Glu, Tyr) 4:1 was diluted to 20 μg/mL with potassium-free PBS (10 mM sodium phosphate buffer, 150 mM NaCl, pH 7.2...
Ligand InfoPC cidPC sid
In DepthDetails US Patent