BDBM604822 US11661431, Example B-1
SMILES COc1cc(cn2ncnc12)-c1[nH]c2cc(sc2c1C(C)C)C1CCNCC1
InChI Key InChIKey=XVZRMRXEPVVMFR-UHFFFAOYSA-N
Data  1 IC50
  Tab Delimited (TSV)   2D SDfile   Computed 3D by Vconf -m prep SDfile
Find this compound or compounds like it in BindingDB:
Activity Spreadsheet -- Enzyme Inhibition Constant Data from BindingDB
Found 1 hit for monomerid = 604822
TargetMultidrug and toxin extrusion protein 2(Homo sapiens (Human))
Gilead Sciences
US Patent
LigandPNGBDBM604822(US11661431, Example B-1)
Affinity DataIC50:  1.10E+3nM. Assay description: MATE2-K (multidrug and toxin extrusion protein 2) is expressed in the apical membrane in the kidney and mediates the elimination of compounds to urin...
Ligand InfoPC cidPC sid
In DepthDetails US Patent