BDBM604825 US11661431, Example 79
SMILES CC(C)c1c([nH]c2sc([C@@H]3C[C@@H]4C[C@H]3CN4CC(N)=O)c(C)c12)-c1cn2ncnc2c(C)c1C
InChI Key
Data  1 IC50
  Tab Delimited (TSV)   2D SDfile   Computed 3D by Vconf -m prep SDfile
Find this compound or compounds like it in BindingDB:
Activity Spreadsheet -- Enzyme Inhibition Constant Data from BindingDB
Found 1 hit for monomerid = 604825
TargetMultidrug and toxin extrusion protein 2(Homo sapiens (Human))
Gilead Sciences
US Patent
LigandPNGBDBM604825(US11661431, Example 79)
Affinity DataIC50:  8.10E+3nM. Assay description: MATE2-K (multidrug and toxin extrusion protein 2) is expressed in the apical membrane in the kidney and mediates the elimination of compounds to urin...
Ligand InfoPC cidPC sid
In DepthDetails US Patent