BDBM604880 N-(5-Cyano-4-((2-methoxyethyl)amino)pyridin-2-yl)-7-formyl-6-((4-methyl-2-carbonyl -1,4-diazoheptyl-1-yl)methyl)-3,4-dihydro-1,8-naphthyridin-1(2H)-carboxamide::US11667631, Example 7
SMILES COCCNc1cc(NC(=O)N2CCCc3cc(CN4CCCN(C)CC4=O)c(C=O)nc23)ncc1C#N
InChI Key InChIKey=YHRJDRIYFKKNMC-UHFFFAOYSA-N
Data  2 IC50
  Tab Delimited (TSV)   2D SDfile   Computed 3D by Vconf -m prep SDfile
Find this compound or compounds like it in BindingDB:
Activity Spreadsheet -- Enzyme Inhibition Constant Data from BindingDB
Found 2 hits for monomerid = 604880
TargetFibroblast growth factor receptor 1(Homo sapiens (Human))
Jiangsu Hansoh Pharmaceutical Group
US Patent
LigandPNGBDBM604880(N-(5-Cyano-4-((2-methoxyethyl)amino)pyridin-2-yl)-...)
Affinity DataIC50: >1.00E+4nM. Assay description: In this experiment, the inhibitory effect of the compounds on FGFR1 kinase activity was tested by a fluorescence resonance energy transfer (TR-FRET) ...
Ligand InfoPC cidPC sid
In DepthDetails US Patent
TargetFibroblast growth factor receptor 4(Homo sapiens (Human))
Jiangsu Hansoh Pharmaceutical Group
US Patent
LigandPNGBDBM604880(N-(5-Cyano-4-((2-methoxyethyl)amino)pyridin-2-yl)-...)
Affinity DataIC50:  0.600nM. Assay description: In this experiment, the inhibitory effect of the compounds on FGFR4 kinase activity was tested by a fluorescence resonance energy transfer (TR-FRET) ...
Ligand InfoPC cidPC sid
In DepthDetails US Patent