BDBM60810 US9169252, 443
SMILES COC(C)(C)[C@H](F)CNC(=O)c1cnc(cc1NC1CCCC(CO)C1)-n1ccc2cc(cnc12)C#N
InChI Key InChIKey=MKRIABWYOGTFNN-VBVCHWQCSA-N
Data  1 IC50
  Tab Delimited (TSV)   2D SDfile   Computed 3D by Vconf -m prep SDfile
Find this compound or compounds like it in BindingDB:
Activity Spreadsheet -- Enzyme Inhibition Constant Data from BindingDB
Found 1 hit for monomerid = 60810
TargetInterleukin-1 receptor-associated kinase 4(Homo sapiens (Human))
Bristol-Myers Squibb
US Patent
LigandPNGBDBM60810(US9169252, 443)
Affinity DataIC50:  1.60nMpH: 7.2 T: 2°C. Assay description: The assays were performed in U-bottom 384-well plates. The final assay volume was 30 L prepared from 15 L additions of enzyme and substrates (fluores...
In DepthDetails US Patent