BDBM610158 N-(5-(2,3-dihydrobenzo[b][1,4]dioxine-6-carboxamido)-2-methylphenyl)-2-(2-(dimethylamino)ethoxy)quinoline-6-carboxamide::US9701664, Example 62
SMILES CN(C)CCOc1ccc2cc(ccc2n1)C(=O)Nc1cc(NC(=O)c2ccc3OCCOc3c2)ccc1C
InChI Key InChIKey=QWZHIYWUJIJIAC-UHFFFAOYSA-N
Data  2 IC50
  Tab Delimited (TSV)   2D SDfile   Computed 3D by Vconf -m prep SDfile
Find this compound or compounds like it in BindingDB:
Activity Spreadsheet -- Enzyme Inhibition Constant Data from BindingDB
Found 2 hits for monomerid = 610158
TargetHeat shock factor protein 1(Homo sapiens (Human))
Cancer Research Technology
US Patent
LigandPNGBDBM610158(N-(5-(2,3-dihydrobenzo[b][1,4]dioxine-6-carboxamid...)
Affinity DataIC50:  16nM. Assay description: The cell titre blue viability (Promega, USA) assay provides a homogenous, fluorometric method for estimating the number of viable cells. It uses the ...
Ligand InfoPC cidPC sid
In DepthDetails US Patent
TargetHeat shock factor protein 1(Homo sapiens (Human))
Cancer Research Technology
US Patent
LigandPNGBDBM610158(N-(5-(2,3-dihydrobenzo[b][1,4]dioxine-6-carboxamid...)
Affinity DataIC50:  17nM. Assay description: U2OS cells (5-8×104 cells/mL) or SK-OV-3 cells (5-8×104 cells/mL) were seeded into 96-well plates and incubated at 37° C. for 48 h. Compounds were th...
Ligand InfoPC cidPC sid
In DepthDetails US Patent