BDBM610453 2-Phenyl-N-(4-(2,2,2-trifluoroethoxy)pyridin-3-yl)imidazo[1,2-b]pyridazine-8-carboxamide::US10774086, Example 4
SMILES FC(F)(F)COc1ccncc1NC(=O)c1ccnn2cc(nc12)-c1ccccc1
InChI Key InChIKey=CJBGZDIMVHUOFK-UHFFFAOYSA-N
Data  4 IC50
  Tab Delimited (TSV)   2D SDfile   Computed 3D by Vconf -m prep SDfile
Find this compound or compounds like it in BindingDB:
Activity Spreadsheet -- Enzyme Inhibition Constant Data from BindingDB
Found 4 hits for monomerid = 610453
TargetGlycogen synthase kinase-3 beta(Homo sapiens (Human))
Bristol-Myers Squibb
US Patent
LigandPNGBDBM610453(2-Phenyl-N-(4-(2,2,2-trifluoroethoxy)pyridin-3-yl)...)
Affinity DataIC50:  0.300nM. Assay description: The kinase assay was performed in V-bottom 384-well plates. The final assay volume was 30 μl prepared from 15 μl additions of enzyme, subst...
Ligand InfoPC cidPC sid
In DepthDetails US Patent
TargetGlycogen synthase kinase-3 alpha(Homo sapiens (Human))TBA
LigandPNGBDBM610453(2-Phenyl-N-(4-(2,2,2-trifluoroethoxy)pyridin-3-yl)...)
Affinity DataIC50:  0.0900nM. Assay description: Inhibition of full length GST-tagged human recombinant GSK3-alpha using FL-KRREILSRRP[ps]ERYR-NH2 as substrate incubated for 20 hrs
Ligand InfoPC cidPC sid
In DepthDetails PubMed
TargetMicrotubule-associated protein tau(Homo sapiens (Human))
Bristol-Myers Squibb
US Patent
LigandPNGBDBM610453(2-Phenyl-N-(4-(2,2,2-trifluoroethoxy)pyridin-3-yl)...)
Affinity DataIC50:  22nM. Assay description: The kinase assay was performed in V-bottom 384-well plates. The final assay volume was 30 μl prepared from 15 μl additions of enzyme, subst...
Ligand InfoPC cidPC sid
In DepthDetails US Patent
TargetGlycogen synthase kinase-3 alpha(Homo sapiens (Human))TBA
LigandPNGBDBM610453(2-Phenyl-N-(4-(2,2,2-trifluoroethoxy)pyridin-3-yl)...)
Affinity DataIC50:  0.100nM. Assay description: The kinase assay was performed in V-bottom 384-well plates. The final assay volume was 30 μl prepared from 15 μl additions of enzyme, subst...
Ligand InfoPC cidPC sid
In DepthDetails US Patent