BDBM610462 N-(4-Morpholinopyridin-3-yl)-2-phenylimidazo[1,2-b]pyridazine-8-carboxamide::US10774086, Example 13
SMILES O=C(Nc1cnccc1N1CCOCC1)c1ccnn2cc(nc12)-c1ccccc1
InChI Key InChIKey=KZAWBYUYDLDFQY-UHFFFAOYSA-N
Data  5 IC50
  Tab Delimited (TSV)   2D SDfile   Computed 3D by Vconf -m prep SDfile
Find this compound or compounds like it in BindingDB:
Activity Spreadsheet -- Enzyme Inhibition Constant Data from BindingDB
Found 5 hits for monomerid = 610462
TargetGlycogen synthase kinase-3 beta(Homo sapiens (Human))
Bristol-Myers Squibb
US Patent
LigandPNGBDBM610462(N-(4-Morpholinopyridin-3-yl)-2-phenylimidazo[1,2-b...)
Affinity DataIC50:  0.400nM. Assay description: The kinase assay was performed in V-bottom 384-well plates. The final assay volume was 30 μl prepared from 15 μl additions of enzyme, subst...
Ligand InfoPC cidPC sid
In DepthDetails US Patent
TargetGlycogen synthase kinase-3 alpha(Homo sapiens (Human))
Bristol-Myers Squibb
US Patent
LigandPNGBDBM610462(N-(4-Morpholinopyridin-3-yl)-2-phenylimidazo[1,2-b...)
Affinity DataIC50:  0.200nM. Assay description: The kinase assay was performed in V-bottom 384-well plates. The final assay volume was 30 μl prepared from 15 μl additions of enzyme, subst...
Ligand InfoPC cidPC sid
In DepthDetails US Patent
TargetMicrotubule-associated protein tau(Homo sapiens (Human))TBA
LigandPNGBDBM610462(N-(4-Morpholinopyridin-3-yl)-2-phenylimidazo[1,2-b...)
Affinity DataIC50:  36nM. Assay description: Inhibition of tau 4R1N phosphorylation (unknown origin) at S396 residue transfected in human U2OS cells coexpressing GFP-tagged beta catenin incubate...
Ligand InfoPC cidPC sid
In DepthDetails PubMed
TargetGlycogen synthase kinase-3 alpha(Homo sapiens (Human))
Bristol-Myers Squibb
US Patent
LigandPNGBDBM610462(N-(4-Morpholinopyridin-3-yl)-2-phenylimidazo[1,2-b...)
Affinity DataIC50:  0.210nM. Assay description: Inhibition of full length GST-tagged human recombinant GSK3-alpha using FL-KRREILSRRP[ps]ERYR-NH2 as substrate incubated for 20 hrs
Ligand InfoPC cidPC sid
In DepthDetails PubMed
TargetMicrotubule-associated protein tau(Homo sapiens (Human))TBA
LigandPNGBDBM610462(N-(4-Morpholinopyridin-3-yl)-2-phenylimidazo[1,2-b...)
Affinity DataIC50:  36nM. Assay description: The kinase assay was performed in V-bottom 384-well plates. The final assay volume was 30 μl prepared from 15 μl additions of enzyme, subst...
Ligand InfoPC cidPC sid
In DepthDetails US Patent