BDBM61322 5,7-dimethoxy-8-[1-(4-methoxyphenyl)-3-oxidanylidene-3-piperidin-1-yl-propyl]-4-phenyl-chromen-2-one::5,7-dimethoxy-8-[1-(4-methoxyphenyl)-3-oxo-3-(1-piperidinyl)propyl]-4-phenyl-1-benzopyran-2-one::5,7-dimethoxy-8-[1-(4-methoxyphenyl)-3-oxo-3-piperidin-1-ylpropyl]-4-phenylchromen-2-one::8-[3-keto-1-(4-methoxyphenyl)-3-piperidino-propyl]-5,7-dimethoxy-4-phenyl-coumarin::MLS000879461::SMR000465526::cid_16746331
SMILES COc1ccc(cc1)C(CC(=O)N1CCCCC1)c1c(OC)cc(OC)c2c(cc(=O)oc12)-c1ccccc1
InChI Key InChIKey=BAZQPZSKCSOREV-UHFFFAOYSA-N
Data  5 IC50
  Tab Delimited (TSV)   2D SDfile   Computed 3D by Vconf -m prep SDfile
Find this compound or compounds like it in BindingDB:
Activity Spreadsheet -- Enzyme Inhibition Constant Data from BindingDB
Found 5 hits for monomerid = 61322
TargetPolyadenylate-binding protein 1(Homo sapiens (Human))
Burnham Center For Chemical Genomics
Curated by PubChem BioAssay
LigandPNGBDBM61322(5,7-dimethoxy-8-[1-(4-methoxyphenyl)-3-oxidanylide...)
Affinity DataIC50:  3.34E+4nM. Assay description: Data Source: Sanford-Burnham Center for Chemical Genomics (SBCCG) Source Affiliation: Sanford-Burnham Medical Research Institute (SBMRI, San Diego, C...
In DepthDetails PCBioAssay
TargetEukaryotic translation initiation factor 4H(Homo sapiens (Human))
Burnham Center For Chemical Genomics
Curated by PubChem BioAssay
LigandPNGBDBM61322(5,7-dimethoxy-8-[1-(4-methoxyphenyl)-3-oxidanylide...)
Affinity DataIC50:  7.25E+3nM. Assay description: Data Source: Sanford-Burnham Center for Chemical Genomics (SBCCG) Source Affiliation: Sanford-Burnham Medical Research Institute (SBMRI, San Diego, C...
In DepthDetails PCBioAssay
TargetCarboxy-terminal domain RNA polymerase II polypeptide A small phosphatase 1(Homo sapiens (Human))
Burnham Center For Chemical Genomics
Curated by PubChem BioAssay
LigandPNGBDBM61322(5,7-dimethoxy-8-[1-(4-methoxyphenyl)-3-oxidanylide...)
Affinity DataIC50:  4.70E+3nM. Assay description: Data Source: Sanford-Burnham Center for Chemical Genomics (SBCCG) Source Affiliation: Sanford-Burnham Medical Research Institute (SBMRI, San Diego, C...
In DepthDetails PCBioAssay
TargetDNA dC->dU-editing enzyme APOBEC-3G(Homo sapiens (Human))
Burnham Center For Chemical Genomics
Curated by PubChem BioAssay
LigandPNGBDBM61322(5,7-dimethoxy-8-[1-(4-methoxyphenyl)-3-oxidanylide...)
Affinity DataIC50:  2.59E+4nMT: 2°C. Assay description: Data Source: Sanford-Burnham Center for Chemical Genomics (SBCCG) Source Affiliation: Sanford-Burnham Medical Research Institute (SBMRI, San Diego, C...
In DepthDetails PCBioAssay
TargetDNA dC->dU-editing enzyme APOBEC-3A(Homo sapiens (Human))
Burnham Center For Chemical Genomics
Curated by PubChem BioAssay
LigandPNGBDBM61322(5,7-dimethoxy-8-[1-(4-methoxyphenyl)-3-oxidanylide...)
Affinity DataIC50:  1.04E+4nMT: 2°C. Assay description: Data Source: Sanford-Burnham Center for Chemical Genomics (SBCCG) Source Affiliation: Sanford-Burnham Medical Research Institute (SBMRI, San Diego, C...
In DepthDetails PCBioAssay