BDBM617534 US20230286943, Example 2
SMILES C[C@H]1CC[C@@H](CC1)[C@H](NC(=O)c1ccnn1C)C(=O)Nc1ccc(c(F)c1)-c1ccc(=O)n(C)c1C
InChI Key InChIKey=MKIMDHZJXKVPJS-YLNNLZOCSA-N
Data  1 IC50
  Tab Delimited (TSV)   2D SDfile   Computed 3D by Vconf -m prep SDfile
Find this compound or compounds like it in BindingDB:
Activity Spreadsheet -- Enzyme Inhibition Constant Data from BindingDB
Found 1 hit for monomerid = 617534
TargetInterleukin-17F(Homo sapiens (Human))
Sanofi
US Patent
LigandPNGBDBM617534(US20230286943, Example 2)
Affinity DataIC50:  63.1nM. Assay description: The ability of the compounds to block binding of IL-17A to its receptor, IL-17RA, was analysed in a competition assay using AlphaLISA technology (Per...
Ligand InfoPC cidPC sid
In DepthDetails US Patent