BDBM617566 US20230286943, Example 34
SMILES Cc1noc(C)c1-c1ccc(NC(=O)[C@@H](NC(=O)c2ccnn2C)C2CCCCCC2)nc1
InChI Key InChIKey=UCRZCZSBHIWBAA-QFIPXVFZSA-N
Data  1 IC50
  Tab Delimited (TSV)   2D SDfile   Computed 3D by Vconf -m prep SDfile
Find this compound or compounds like it in BindingDB:
Activity Spreadsheet -- Enzyme Inhibition Constant Data from BindingDB
Found 1 hit for monomerid = 617566
TargetInterleukin-17F(Homo sapiens (Human))
Sanofi
US Patent
LigandPNGBDBM617566(US20230286943, Example 34)
Affinity DataIC50:  126nM. Assay description: The ability of the compounds to block binding of IL-17A to its receptor, IL-17RA, was analysed in a competition assay using AlphaLISA technology (Per...
Ligand InfoPC cidPC sid
In DepthDetails US Patent