BDBM617610 US20230286943, Example 78
SMILES CCn1nccc1C(=O)N[C@@H]([C@H]1CC[C@H](C)CC1)C(=O)Nc1ccc(cn1)-c1c(C)nnn1C
InChI Key InChIKey=RYKXCUCPUPCRHP-WJPUGNRLSA-N
Data  1 IC50
  Tab Delimited (TSV)   2D SDfile   Computed 3D by Vconf -m prep SDfile
Find this compound or compounds like it in BindingDB:
Activity Spreadsheet -- Enzyme Inhibition Constant Data from BindingDB
Found 1 hit for monomerid = 617610
TargetInterleukin-17F(Homo sapiens (Human))
Sanofi
US Patent
LigandPNGBDBM617610(US20230286943, Example 78)
Affinity DataIC50:  100nM. Assay description: The ability of the compounds to block binding of IL-17A to its receptor, IL-17RA, was analysed in a competition assay using AlphaLISA technology (Per...
Ligand InfoPC cidPC sid
In DepthDetails US Patent