BDBM617633 US20230286943, Example 101
SMILES Cn1nccc1C(=O)N[C@@H](C1CCCCCC1)C(=O)Nc1ccc(cn1)-c1c(CO)cnn1C
InChI Key InChIKey=NFZICCYWLJODBM-NRFANRHFSA-N
Data  1 IC50
  Tab Delimited (TSV)   2D SDfile   Computed 3D by Vconf -m prep SDfile
Find this compound or compounds like it in BindingDB:
Activity Spreadsheet -- Enzyme Inhibition Constant Data from BindingDB
Found 1 hit for monomerid = 617633
TargetInterleukin-17F(Homo sapiens (Human))
Sanofi
US Patent
LigandPNGBDBM617633(US20230286943, Example 101)
Affinity DataIC50:  31.6nM. Assay description: The ability of the compounds to block binding of IL-17A to its receptor, IL-17RA, was analysed in a competition assay using AlphaLISA technology (Per...
Ligand InfoPC cidPC sid
In DepthDetails US Patent