BDBM62228 (E)-N-(4-hydroxy-2-isopropyl-5-methyl-phenyl)-3-phenyl-acrylamide::(E)-N-(4-hydroxy-5-methyl-2-propan-2-ylphenyl)-3-phenyl-2-propenamide::(E)-N-(4-hydroxy-5-methyl-2-propan-2-ylphenyl)-3-phenylprop-2-enamide::(E)-N-(5-methyl-4-oxidanyl-2-propan-2-yl-phenyl)-3-phenyl-prop-2-enamide::SR-01000744962::SR-01000744962-2::cid_706322
SMILES CC(C)c1cc(O)c(C)cc1NC(=O)\C=C\c1ccccc1
InChI Key InChIKey=KXWYLQAIPQJIPG-MDZDMXLPSA-N
Data  5 IC50
  Tab Delimited (TSV)   2D SDfile   Computed 3D by Vconf -m prep SDfile
Find this compound or compounds like it in BindingDB:
Activity Spreadsheet -- Enzyme Inhibition Constant Data from BindingDB
Found 5 hits for monomerid = 62228
TargetSphingosine 1-phosphate receptor 4(Homo sapiens (Human))
The Scripps Research Institute Molecular Screening Center
Curated by PubChem BioAssay
LigandPNGBDBM62228((E)-N-(4-hydroxy-2-isopropyl-5-methyl-phenyl)-3-ph...)
Affinity DataIC50:  339nM. Assay description: Source (MLPCN Center Name): The Scripps Research Institute Molecular Screening Center (SRISMC) Center Affiliation: The Scripps Research Institute (TS...
In DepthDetails PCBioAssay
TargetSphingosine 1-phosphate receptor 3(Homo sapiens (Human))
The Scripps Research Institute Molecular Screening Center
Curated by PubChem BioAssay
LigandPNGBDBM62228((E)-N-(4-hydroxy-2-isopropyl-5-methyl-phenyl)-3-ph...)
Affinity DataIC50:  2.50E+4nM. Assay description: Source (MLPCN Center Name): The Scripps Research Institute Molecular Screening Center (SRISMC) Center Affiliation: The Scripps Research Institute (TS...
In DepthDetails PCBioAssay
TargetSphingosine 1-phosphate receptor 2(Homo sapiens (Human))
The Scripps Research Institute Molecular Screening Center
Curated by PubChem BioAssay
LigandPNGBDBM62228((E)-N-(4-hydroxy-2-isopropyl-5-methyl-phenyl)-3-ph...)
Affinity DataIC50: >2.50E+4nM. Assay description: Source (MLPCN Center Name): The Scripps Research Institute Molecular Screening Center (SRISMC) Center Affiliation: The Scripps Research Institute (TS...
In DepthDetails PCBioAssay
TargetSphingosine 1-phosphate receptor 1(Homo sapiens (Human))
The Scripps Research Institute Molecular Screening Center
Curated by PubChem BioAssay
LigandPNGBDBM62228((E)-N-(4-hydroxy-2-isopropyl-5-methyl-phenyl)-3-ph...)
Affinity DataIC50: >2.50E+4nM. Assay description: Source (MLPCN Center Name): The Scripps Research Institute Molecular Screening Center (SRISMC) Center Affiliation: The Scripps Research Institute (TS...
In DepthDetails PCBioAssay
TargetSphingosine 1-phosphate receptor 5(Homo sapiens (Human))
The Scripps Research Institute Molecular Screening Center
Curated by PubChem BioAssay
LigandPNGBDBM62228((E)-N-(4-hydroxy-2-isopropyl-5-methyl-phenyl)-3-ph...)
Affinity DataIC50: >2.50E+4nM. Assay description: Source (MLPCN Center Name): The Scripps Research Institute Molecular Screening Center (SRISMC) Center Affiliation: The Scripps Research Institute (TS...
In DepthDetails PCBioAssay