BDBM635364 N-(2-fluoro-4-methyl-5-(8- morpholinoimidazo[1,2-a]pyridin-6-yl)phenyl)-3- (perfluoroethyl)-2,5-dihydro-1H-pyrrole-1- carboxamide::US11814384, Example 22
SMILES Cc1cc(F)c(NC(=O)N2CC=C(C2)C(F)(F)C(F)(F)F)cc1-c1cc(N2CCOCC2)c2nccn2c1
InChI Key InChIKey=CYCIAWQLCQMDFV-UHFFFAOYSA-N
Data  1 IC50
  Tab Delimited (TSV)   2D SDfile   Computed 3D by Vconf -m prep SDfile
Find this compound or compounds like it in BindingDB:
Activity Spreadsheet -- Enzyme Inhibition Constant Data from BindingDB
Found 1 hit for monomerid = 635364
TargetSerine/threonine-protein kinase B-raf(Homo sapiens (Human))
Kinnate Biopharma
US Patent
LigandPNGBDBM635364(N-(2-fluoro-4-methyl-5-(8- morpholinoimidazo[1,2-a...)
Affinity DataIC50:  5.5nM. Assay description: Small molecule inhibition of the BRAF kinases was measured using ADP-Glo assay. In the assay, ADP is converted to ATP in the presence of test kinase ...
Ligand InfoPC cidPC sid
In DepthDetails US Patent