BDBM635453 N-(1-(tert-Butyl)-5-fluoro-1H-pyrazol-4-yl)-2- fluoro-4-methyl-5-(2-methyl-8-morpholino- [1,2,4]triazolo[1,5-a]pyridin-6-yl)benzamide::US11814384, Example 285
SMILES Cc1nc2c(cc(cn2n1)-c1cc(C(=O)Nc2cnn(c2F)C(C)(C)C)c(F)cc1C)N1CCOCC1
InChI Key InChIKey=ZXUFYYRHUVRUGL-UHFFFAOYSA-N
Data  1 IC50
  Tab Delimited (TSV)   2D SDfile   Computed 3D by Vconf -m prep SDfile
Find this compound or compounds like it in BindingDB:
Activity Spreadsheet -- Enzyme Inhibition Constant Data from BindingDB
Found 1 hit for monomerid = 635453
TargetSerine/threonine-protein kinase B-raf(Homo sapiens (Human))
Kinnate Biopharma
US Patent
LigandPNGBDBM635453(N-(1-(tert-Butyl)-5-fluoro-1H-pyrazol-4-yl)-2- flu...)
Affinity DataIC50:  5.5nM. Assay description: Small molecule inhibition of the BRAF kinases was measured using ADP-Glo assay. In the assay, ADP is converted to ATP in the presence of test kinase ...
Ligand InfoPC cidPC sid
In DepthDetails US Patent