BDBM639343 3-(1-Methyl-1H-imidazol-2-yl)propyl 3-[(5-chlorothiophene-2-carbonyl)amino]-N-[2-ethyl-3-(2-oxopyrrolidin-1-yl)benzene-1-sulfonyl]-S-alaninate hydrochloride::US20230391761, Reference 11
SMILES CCc1c(cccc1S(=O)(=O)N[C@@H](CNC(=O)c1ccc(Cl)s1)C(=O)OCCCc1nccn1C)N1CCCC1=O
InChI Key InChIKey=MTGQBIHLRYXSAD-IBGZPJMESA-N
Data  12 IC50
  Tab Delimited (TSV)   2D SDfile   Computed 3D by Vconf -m prep SDfile
Find this compound or compounds like it in BindingDB:
Activity Spreadsheet -- Enzyme Inhibition Constant Data from BindingDB
Found 12 hits for monomerid = 639343
TargetCoagulation factor X(Homo sapiens (Human))
Bayer Aktiengesellschaft
US Patent
LigandPNGBDBM639343(3-(1-Methyl-1H-imidazol-2-yl)propyl 3-[(5-chloroth...)
Affinity DataIC50:  0.480nM. Assay description: Determination of the Selectivity To demonstrate the selectivity of the substances with respect to thrombin and factor Xa inhibition, the test substan...
Ligand InfoPC cidPC sid
In DepthDetails US Patent
TargetProthrombin(Homo sapiens (Human))
Bayer Aktiengesellschaft
US Patent
LigandPNGBDBM639343(3-(1-Methyl-1H-imidazol-2-yl)propyl 3-[(5-chloroth...)
Affinity DataIC50:  1.80nM. Assay description: Determination of the Selectivity To demonstrate the selectivity of the substances with respect to thrombin and factor Xa inhibition, the test substan...
Ligand InfoPC cidPC sid
In DepthDetails US Patent
TargetCoagulation factor XI(Homo sapiens (Human))
Bayer Aktiengesellschaft
US Patent
LigandPNGBDBM639343(3-(1-Methyl-1H-imidazol-2-yl)propyl 3-[(5-chloroth...)
Affinity DataIC50:  8.30E+3nM. Assay description: Determination of the Selectivity To demonstrate the selectivity of the substances with respect to thrombin and factor Xa inhibition, the test substan...
Ligand InfoPC cidPC sid
In DepthDetails US Patent
TargetSerine protease 1(Homo sapiens (Human))
Bayer Aktiengesellschaft
US Patent
LigandPNGBDBM639343(3-(1-Methyl-1H-imidazol-2-yl)propyl 3-[(5-chloroth...)
Affinity DataIC50:  3.00E+3nM. Assay description: Determination of the Selectivity To demonstrate the selectivity of the substances with respect to thrombin and factor Xa inhibition, the test substan...
Ligand InfoPC cidPC sid
In DepthDetails US Patent
TargetPlasminogen(Homo sapiens (Human))
Bayer Aktiengesellschaft
US Patent
LigandPNGBDBM639343(3-(1-Methyl-1H-imidazol-2-yl)propyl 3-[(5-chloroth...)
Affinity DataIC50:  4.90E+3nM. Assay description: Determination of the Selectivity To demonstrate the selectivity of the substances with respect to thrombin and factor Xa inhibition, the test substan...
Ligand InfoPC cidPC sid
In DepthDetails US Patent
TargetCytochrome P450 2D6(Homo sapiens (Human))
Bayer Aktiengesellschaft
US Patent
LigandPNGBDBM639343(3-(1-Methyl-1H-imidazol-2-yl)propyl 3-[(5-chloroth...)
Affinity DataIC50: >2.00E+4nM. Assay description: Determination of the Selectivity To demonstrate the selectivity of the substances with respect to thrombin and factor Xa inhibition, the test substan...
Ligand InfoPC cidPC sid
In DepthDetails US Patent
TargetKallikrein-1(Homo sapiens (Human))
Bayer Aktiengesellschaft
US Patent
LigandPNGBDBM639343(3-(1-Methyl-1H-imidazol-2-yl)propyl 3-[(5-chloroth...)
Affinity DataIC50:  33nM. Assay description: Determination of the Selectivity To demonstrate the selectivity of the substances with respect to thrombin and factor Xa inhibition, the test substan...
Ligand InfoPC cidPC sid
In DepthDetails US Patent
TargetCytochrome P450 3A4(Homo sapiens (Human))
Bayer Aktiengesellschaft
US Patent
LigandPNGBDBM639343(3-(1-Methyl-1H-imidazol-2-yl)propyl 3-[(5-chloroth...)
Affinity DataIC50:  6.90E+3nM. Assay description: Determination of the Selectivity To demonstrate the selectivity of the substances with respect to thrombin and factor Xa inhibition, the test substan...
Ligand InfoPC cidPC sid
In DepthDetails US Patent
TargetCytochrome P450 1A2(Homo sapiens (Human))
Bayer Aktiengesellschaft
US Patent
LigandPNGBDBM639343(3-(1-Methyl-1H-imidazol-2-yl)propyl 3-[(5-chloroth...)
Affinity DataIC50: >2.00E+4nM. Assay description: Determination of the Selectivity To demonstrate the selectivity of the substances with respect to thrombin and factor Xa inhibition, the test substan...
Ligand InfoPC cidPC sid
In DepthDetails US Patent
TargetCytochrome P450 2C8(Homo sapiens (Human))
Bayer Aktiengesellschaft
US Patent
LigandPNGBDBM639343(3-(1-Methyl-1H-imidazol-2-yl)propyl 3-[(5-chloroth...)
Affinity DataIC50: >2.00E+4nM. Assay description: Determination of the Selectivity To demonstrate the selectivity of the substances with respect to thrombin and factor Xa inhibition, the test substan...
Ligand InfoPC cidPC sid
In DepthDetails US Patent
TargetCytochrome P450 2C9(Homo sapiens (Human))
Bayer Aktiengesellschaft
US Patent
LigandPNGBDBM639343(3-(1-Methyl-1H-imidazol-2-yl)propyl 3-[(5-chloroth...)
Affinity DataIC50: >2.00E+4nM. Assay description: Determination of the Selectivity To demonstrate the selectivity of the substances with respect to thrombin and factor Xa inhibition, the test substan...
Ligand InfoPC cidPC sid
In DepthDetails US Patent
TargetTissue-type plasminogen activator(Homo sapiens (Human))
Bayer Aktiengesellschaft
US Patent
LigandPNGBDBM639343(3-(1-Methyl-1H-imidazol-2-yl)propyl 3-[(5-chloroth...)
Affinity DataIC50:  1.30E+3nM. Assay description: Determination of the Selectivity To demonstrate the selectivity of the substances with respect to thrombin and factor Xa inhibition, the test substan...
Ligand InfoPC cidPC sid
In DepthDetails US Patent