BDBM644905 US20240009175, Compound 12::US20240009175, Compound 13::[3-Ethyl-7-methoxy-6-(1H-tetrazol-5-yl)- imidazo[1,2-a]pyridin-2-yl]-(5-methyl- thiophen-2-yl)-phenyl-methanol
SMILES CCc1c(nc2cc(OC)c(cn12)-c1nnn[nH]1)C(O)(c1ccc(C)s1)c1ccccc1
InChI Key
Data  2 IC50
  Tab Delimited (TSV)   2D SDfile   Computed 3D by Vconf -m prep SDfile
Find this compound or compounds like it in BindingDB:
Activity Spreadsheet -- Enzyme Inhibition Constant Data from BindingDB
Found 2 hits for monomerid = 644905
TargetAcetyl-coenzyme A synthetase, cytoplasmic(Homo sapiens)
Merck Patent
US Patent
LigandPNGBDBM644905(US20240009175, Compound 12 | US20240009175, Compou...)
Affinity DataIC50:  55nM. Assay description: The assay was performed in Perkin Elmer 384 well white Proxiplates in a total volume of 8 μl. 1 nM (fc)C-term myc tagged ACSS2 (human, recombina...
Ligand InfoPC cidPC sid
In DepthDetails US Patent
TargetAcetyl-coenzyme A synthetase, cytoplasmic(Homo sapiens)
Merck Patent
US Patent
LigandPNGBDBM644905(US20240009175, Compound 12 | US20240009175, Compou...)
Affinity DataIC50: <1nM. Assay description: The assay was performed in Perkin Elmer 384 well white Proxiplates in a total volume of 8 μl. 1 nM (fc)C-term myc tagged ACSS2 (human, recombina...
Ligand InfoPC cidPC sid
In DepthDetails US Patent