BDBM65955 (E)-3-phenyl-1-[2-(trifluoromethyl)-10-phenothiazinyl]-2-propen-1-one::(E)-3-phenyl-1-[2-(trifluoromethyl)phenothiazin-10-yl]prop-2-en-1-one::SR-01000710847::SR-01000710847-3::cid_1850102
SMILES FC(F)(F)c1ccc2Sc3ccccc3N(C(=O)\C=C\c3ccccc3)c2c1
InChI Key InChIKey=JISUWXTUODWXAA-JLHYYAGUSA-N
Data  1 IC50
  Tab Delimited (TSV)   2D SDfile   Computed 3D by Vconf -m prep SDfile
Find this compound or compounds like it in BindingDB:
Activity Spreadsheet -- Enzyme Inhibition Constant Data from BindingDB
Found 1 hit for monomerid = 65955
TargetNADPH oxidase 1(Homo sapiens (Human))
The Scripps Research Institute Molecular Screening Center
Curated by PubChem BioAssay
LigandPNGBDBM65955((E)-3-phenyl-1-[2-(trifluoromethyl)-10-phenothiazi...)
Affinity DataIC50: >5.00E+4nM. Assay description: Data Source (MLPCN Center Name): The Scripps Research Institute Molecular Screening Center (SRIMSC) Center Affiliation: The Scripps Research Institut...
In DepthDetails PCBioAssay