BDBM66693 1-[(5-methoxy-2-methyl-3-phenyl-1-benzofuran-6-yl)methylideneamino]thiourea::5-methoxy-2-methyl-3-phenyl-1-benzofuran-6-carbaldehyde thiosemicarbazone::MLS001178516::SMR000476356::[(5-methoxy-2-methyl-3-phenyl-1-benzofuran-6-yl)methylideneamino]thiourea::[(5-methoxy-2-methyl-3-phenyl-6-benzofuranyl)methylideneamino]thiourea::[(5-methoxy-2-methyl-3-phenyl-benzofuran-6-yl)methyleneamino]thiourea::cid_900047
SMILES COc1cc2c(c(C)oc2cc1C=NNC(N)=S)-c1ccccc1
InChI Key InChIKey=GHMMMPFXCQHEHS-UHFFFAOYSA-N
Data  1 EC50
  Tab Delimited (TSV)   2D SDfile   Computed 3D by Vconf -m prep SDfile
Find this compound or compounds like it in BindingDB:
Activity Spreadsheet -- Enzyme Inhibition Constant Data from BindingDB
Found 1 hit for monomerid = 66693
TargetBcl-2-like protein 11(Homo sapiens (Human))
Broad Institute
Curated by PubChem BioAssay
LigandPNGBDBM66693(1-[(5-methoxy-2-methyl-3-phenyl-1-benzofuran-6-yl)...)
Affinity DataEC50:  1.34E+5nM. Assay description: Keywords: apoptosis, BH3 domain, Bcl2-A1, BIM, caspase, cancer Primary Collaborator: Todd Golub, Broad Institute, golub@broadinstitute.org Assay Over...
In DepthDetails PCBioAssay