BDBM66709 Cyclohexyl-(3-methyl-thiophen-2-ylmethyl)-amine::MLS001208909::N-[(3-methyl-2-thiophenyl)methyl]cyclohexanamine::N-[(3-methylthiophen-2-yl)methyl]cyclohexanamine::SMR000524948::cid_4721499::cyclohexyl-[(3-methyl-2-thienyl)methyl]amine
SMILES Cc1ccsc1CNC1CCCCC1
InChI Key InChIKey=NGMYCEGDKQRRPW-UHFFFAOYSA-N
Data  1 EC50
  Tab Delimited (TSV)   2D SDfile   Computed 3D by Vconf -m prep SDfile
Find this compound or compounds like it in BindingDB:
Activity Spreadsheet -- Enzyme Inhibition Constant Data from BindingDB
Found 1 hit for monomerid = 66709
TargetBcl-2-like protein 11(Homo sapiens (Human))
Broad Institute
Curated by PubChem BioAssay
LigandPNGBDBM66709(Cyclohexyl-(3-methyl-thiophen-2-ylmethyl)-amine | ...)
Affinity DataEC50: >3.50E+5nM. Assay description: Keywords: apoptosis, BH3 domain, Bcl2-A1, BIM, caspase, cancer Primary Collaborator: Todd Golub, Broad Institute, golub@broadinstitute.org Assay Over...
In DepthDetails PCBioAssay