BDBM70822 1-[bis(4-chlorophenyl)methoxy]-3-(3,4-dihydro-1H-isoquinolin-2-yl)-2-propanol;hydrochloride::1-[bis(4-chlorophenyl)methoxy]-3-(3,4-dihydro-1H-isoquinolin-2-yl)propan-2-ol;hydrochloride::MLS000391675::SMR000260710::cid_15944795
SMILES OC(COC(c1ccc(Cl)cc1)c1ccc(Cl)cc1)CN1CCc2ccccc2C1
InChI Key InChIKey=XIRMZNKBAGVWMK-UHFFFAOYSA-N
Data  2 IC50  2 EC50
  Tab Delimited (TSV)   2D SDfile   Computed 3D by Vconf -m prep SDfile
Find this compound or compounds like it in BindingDB:
Activity Spreadsheet -- Enzyme Inhibition Constant Data from BindingDB
Found 2 hits for monomerid = 70822
TargetGuanine nucleotide-binding protein subunit alpha-15(Homo sapiens (Human))
The Scripps Research Institute Molecular Screening Center
Curated by PubChem BioAssay
LigandPNGBDBM70822(1-[bis(4-chlorophenyl)methoxy]-3-(3,4-dihydro-1H-i...)
Affinity DataEC50: >2.99E+4nM
In DepthDetails PCBioAssay
TargetTrace amine-associated receptor 1(Homo sapiens (Human))
The Scripps Research Institute Molecular Screening Center
Curated by PubChem BioAssay
LigandPNGBDBM70822(1-[bis(4-chlorophenyl)methoxy]-3-(3,4-dihydro-1H-i...)
Affinity DataEC50:  2.13E+3nM
In DepthDetails PCBioAssay