BDBM71285 US9546164, 361::US9694002, 361
SMILES CS(=O)(=O)NC(=O)c1cc(C2CC2)c(OCC2CCN(CC2)C(c2ccccc2Cl)c2ccccc2Cl)cc1F
InChI Key InChIKey=RCSJQJZNZNGWGY-UHFFFAOYSA-N
Data  2 IC50
  Tab Delimited (TSV)   2D SDfile   Computed 3D by Vconf -m prep SDfile
Find this compound or compounds like it in BindingDB:
Activity Spreadsheet -- Enzyme Inhibition Constant Data from BindingDB
Found 2 hits for monomerid = 71285
TargetSodium channel protein type 5 subunit alpha(Homo sapiens (Human))
Genentech
US Patent
LigandPNGBDBM71285(US9546164, 361 | US9694002, 361)
Affinity DataIC50:  2nMpH: 7.4 T: 2°C. Assay description: Radioligand Binding Studies: Saturation experiments. A representative compound of formula (I) having a methyl group was tritiated. Three tritiums wer...
Ligand InfoPC cidPC sid
In DepthDetails US Patent
TargetSodium channel protein type 1/10/11/2/3/4/5/8/9 subunit alpha(Homo sapiens (Human))
Genentech
US Patent
LigandPNGBDBM71285(US9546164, 361 | US9694002, 361)
Affinity DataIC50:  2nMpH: 7.4 T: 2°C. Assay description: Binding of this radioligand was preformed in 5 mL borosilicate glass test tubes at room temperature. Binding was initiated by adding membranes to inc...
Ligand InfoPC cidPC sid
In DepthDetails US Patent