BDBM717 (4R)-N-[(2-chlorophenyl)methyl]-3-[(2S,3S)-2-hydroxy-3-[(3-hydroxy-2-methylphenyl)formamido]-4-phenylbutanoyl]-5,5-dimethyl-1,3-thiazolidine-4-carboxamide::(R)-N-(2-Chlorobenzyl)-3-{(2S,3S)-2-hydroxy-3-(3-hydroxy-2-methylbenzoyl)amino-4-phenylbutanoyl]-5,5-dimethyl-1,3-thiazolidine-4-carboxamide::KNI-764 analog::allophenylnorstatine deriv. 15
SMILES Cc1c(O)cccc1C(=O)N[C@@H](Cc1ccccc1)[C@H](O)C(=O)N1CSC(C)(C)[C@H]1C(=O)NCc1ccccc1Cl
InChI Key InChIKey=ZGQZLXSZBYZZLN-DOEKTCAHSA-N
Data  1 KI
  Tab Delimited (TSV)   2D SDfile   Computed 3D by Vconf -m prep SDfile
Find this compound or compounds like it in BindingDB:
Activity Spreadsheet -- Enzyme Inhibition Constant Data from BindingDB
Found 1 hit for monomerid = 717
TargetDimer of Gag-Pol polyprotein [489-587](Human immunodeficiency virus type 1)
Japan Energy
LigandPNGBDBM717((4R)-N-[(2-chlorophenyl)methyl]-3-[(2S,3S)-2-hydro...)
Affinity DataKi:  0.290nM ΔG°:  -13.5kcal/molepH: 6.0 T: 2°C. Assay description: Sensitivity of HIV-1 protease activity to protease inhibitors was determined by a peptide substrate cleavage assay. Substrates and cleavage fragments...
In DepthDetails ArticlePubMed