BDBM73180 3-[[2-[(E)-[2,5-diketo-1-[2-keto-2-(p-toluidino)ethyl]imidazolidin-4-ylidene]methyl]-6-methoxy-phenoxy]methyl]benzoic acid::3-[[2-methoxy-6-[(E)-[1-[2-(4-methylanilino)-2-oxoethyl]-2,5-dioxo-4-imidazolidinylidene]methyl]phenoxy]methyl]benzoic acid::3-[[2-methoxy-6-[(E)-[1-[2-(4-methylanilino)-2-oxoethyl]-2,5-dioxoimidazolidin-4-ylidene]methyl]phenoxy]methyl]benzoic acid::3-[[2-methoxy-6-[(E)-[1-[2-[(4-methylphenyl)amino]-2-oxidanylidene-ethyl]-2,5-bis(oxidanylidene)imidazolidin-4-ylidene]methyl]phenoxy]methyl]benzoic acid::MLS-0355714.0001::cid_24789851
SMILES COc1cccc(\C=C2\NC(=O)N(CC(=O)Nc3ccc(C)cc3)C2=O)c1OCc1cccc(c1)C(O)=O
InChI Key InChIKey=RNEXYVCGGGLVIO-HYARGMPZSA-N
Data  2 IC50
  Tab Delimited (TSV)   2D SDfile   Computed 3D by Vconf -m prep SDfile
Find this compound or compounds like it in BindingDB:
Activity Spreadsheet -- Enzyme Inhibition Constant Data from BindingDB
Found 2 hits for monomerid = 73180
TargetPolyadenylate-binding protein 1(Homo sapiens (Human))
Burnham Center For Chemical Genomics
Curated by PubChem BioAssay
LigandPNGBDBM73180(3-[[2-[(E)-[2,5-diketo-1-[2-keto-2-(p-toluidino)et...)
Affinity DataIC50: >1.00E+5nM. Assay description: Data Source: Sanford-Burnham Center for Chemical Genomics (SBCCG) Source Affiliation: Sanford-Burnham Medical Research Institute(SBMRI, San Diego, CA...
In DepthDetails PCBioAssay
TargetEukaryotic translation initiation factor 4H(Homo sapiens (Human))
Burnham Center For Chemical Genomics
Curated by PubChem BioAssay
LigandPNGBDBM73180(3-[[2-[(E)-[2,5-diketo-1-[2-keto-2-(p-toluidino)et...)
Affinity DataIC50:  1.06E+4nM. Assay description: Data Source: Sanford-Burnham Center for Chemical Genomics (SBCCG) Source Affiliation: Sanford-Burnham Medical Research Institute (SBIMR, San Diego, C...
In DepthDetails PCBioAssay