BDBM73193 2-[6-(furan-2-yl)pyridazin-3-yl]sulfanyl-N-(5-methyl-1,3,4-thiadiazol-2-yl)acetamide::2-[6-(furan-2-yl)pyridazin-3-yl]sulfanyl-N-(5-methyl-1,3,4-thiadiazol-2-yl)ethanamide::2-[[6-(2-furanyl)-3-pyridazinyl]thio]-N-(5-methyl-1,3,4-thiadiazol-2-yl)acetamide::2-[[6-(2-furyl)pyridazin-3-yl]thio]-N-(5-methyl-1,3,4-thiadiazol-2-yl)acetamide::MLS-0241425.0001::cid_7207235
SMILES Cc1nnc(NC(=O)CSc2ccc(nn2)-c2ccco2)s1
InChI Key InChIKey=JIVFLIDRQBSJPT-UHFFFAOYSA-N
Data  2 IC50
  Tab Delimited (TSV)   2D SDfile   Computed 3D by Vconf -m prep SDfile
Find this compound or compounds like it in BindingDB:
Activity Spreadsheet -- Enzyme Inhibition Constant Data from BindingDB
Found 2 hits for monomerid = 73193
TargetPolyadenylate-binding protein 1(Homo sapiens (Human))
Burnham Center For Chemical Genomics
Curated by PubChem BioAssay
LigandPNGBDBM73193(2-[6-(furan-2-yl)pyridazin-3-yl]sulfanyl-N-(5-meth...)
Affinity DataIC50:  6.41E+4nM. Assay description: Data Source: Sanford-Burnham Center for Chemical Genomics (SBCCG) Source Affiliation: Sanford-Burnham Medical Research Institute(SBMRI, San Diego, CA...
In DepthDetails PCBioAssay
TargetEukaryotic translation initiation factor 4H(Homo sapiens (Human))
Burnham Center For Chemical Genomics
Curated by PubChem BioAssay
LigandPNGBDBM73193(2-[6-(furan-2-yl)pyridazin-3-yl]sulfanyl-N-(5-meth...)
Affinity DataIC50:  6.17E+3nM. Assay description: Data Source: Sanford-Burnham Center for Chemical Genomics (SBCCG) Source Affiliation: Sanford-Burnham Medical Research Institute (SBIMR, San Diego, C...
In DepthDetails PCBioAssay