BDBM73876 (4Z)-4-(2,5-dimethoxybenzylidene)-2-phenyl-2-oxazolin-5-one::(4Z)-4-[(2,5-dimethoxyphenyl)methylidene]-2-phenyl-1,3-oxazol-5-one::(4Z)-4-[(2,5-dimethoxyphenyl)methylidene]-2-phenyl-5-oxazolone::4-(2,5-Dimethoxy-benzylidene)-2-phenyl-4H-oxazol-5-one::MLS001209269::SMR000513353::cid_689700
SMILES COc1ccc(OC)c(\C=C2/N=C(OC2=O)c2ccccc2)c1
InChI Key InChIKey=HIPBGLRLKCZQDO-PTNGSMBKSA-N
Data  5 EC50
  Tab Delimited (TSV)   2D SDfile   Computed 3D by Vconf -m prep SDfile
Find this compound or compounds like it in BindingDB:
Activity Spreadsheet -- Enzyme Inhibition Constant Data from BindingDB
Found 5 hits for monomerid = 73876
TargetProtein LANA1(Human herpesvirus 8)
Broad Institute
Curated by PubChem BioAssay
LigandPNGBDBM73876((4Z)-4-(2,5-dimethoxybenzylidene)-2-phenyl-2-oxazo...)
Affinity DataEC50: >7.50E+4nM. Assay description: Primary Collaborators: Kenneth Kaye,Brigham & Womens,Boston MA,kkaye@rics.bwh.harvard.edu,617-525-4256 Chantal Beauchemin,Brigham & Womens,Boston MA,...
In DepthDetails PCBioAssay
TargetTropomyosin alpha-1 chain(Sus scrofa)
The Scripps Research Institute Molecular Screening Center
Curated by PubChem BioAssay
LigandPNGBDBM73876((4Z)-4-(2,5-dimethoxybenzylidene)-2-phenyl-2-oxazo...)
Affinity DataEC50:  2.58E+3nM. Assay description: Source (MLPCN Center Name): The Scripps Research Institute Molecular Screening Center (SRIMSC) Affiliation: The Scripps Research Institute, TSRI Assa...
In DepthDetails PCBioAssay
TargetCorticotropin-releasing factor-binding protein(Homo sapiens (Human))
Burnham Center For Chemical Genomics
Curated by PubChem BioAssay
LigandPNGBDBM73876((4Z)-4-(2,5-dimethoxybenzylidene)-2-phenyl-2-oxazo...)
Affinity DataEC50:  2.29E+3nM. Assay description: Data Source: Sanford-Burnham Center for Chemical Genomics (SBCCG) Source Affiliation: Sanford-Burnham Medical Research Institute (SBMRI, San Diego, C...
In DepthDetails PCBioAssay
TargetEndoribonuclease toxin MazF(Escherichia coli str. K-12 substr. MG1655)
Burnham Center For Chemical Genomics
Curated by PubChem BioAssay
LigandPNGBDBM73876((4Z)-4-(2,5-dimethoxybenzylidene)-2-phenyl-2-oxazo...)
Affinity DataEC50: >9.90E+4nM. Assay description: Data Source: Sanford-Burnham Center for Chemical Genomics (SBCCG) Source Affiliation: Sanford-Burnham Medical Research Institute (SBMRI, San Diego, C...
In DepthDetails PCBioAssay
TargetEndoribonuclease toxin MazF(Escherichia coli str. K-12 substr. MG1655)
Burnham Center For Chemical Genomics
Curated by PubChem BioAssay
LigandPNGBDBM73876((4Z)-4-(2,5-dimethoxybenzylidene)-2-phenyl-2-oxazo...)
Affinity DataEC50:  3.91E+4nM. Assay description: Data Source: Sanford-Burnham Center for Chemical Genomics (SBCCG) Source Affiliation: Sanford-Burnham Medical Research Institute (SBMRI, San Diego, C...
In DepthDetails PCBioAssay